{"text_format":"1","workbook":"xlsx","n_sheets":5,"sheets":["Hárok1","Hárok2","Hárok3","Hárok4","Hárok5"],"not_rendered":{"charts":0,"images":0,"macros":1,"external_links":0,"defined_names":0,"comments":0,"pivot_tables":0},"unopened":[],"bounds":{"document_bytes":16777216,"sheet_cells":100000,"rows_first":2000,"rows_last":500,"rows_between":2000,"halvings":0,"cell_chars":16384,"cell_head_chars":4096},"cells_cut":0,"cells_raw":0,"read":"whole","date_system":"1900"}

{"sheet":"Hárok1","index":0,"n_rows":30,"n_cols":32,"rows_kept":30,"cut":false,"hidden":false,"merged":[]}
[null,null,null,0,1,2,3,4,5,6,7,8,9,10,11,12,13,14,15,16,17,18,19,20,21,22,23,24,25,26,27,28]
[null,null,0]
[null,null,1,null,{"$f":"MOD(MOD(E1^3,29)*MOD(MOD(E1^4,29)^2,29)*MOD(MOD(MOD(E1^4,29)^2,29)^2,29),29)","v":1},{"$f":"MOD(MOD(F1^3,29)*MOD(MOD(F1^4,29)^2,29)*MOD(MOD(MOD(F1^4,29)^2,29)^2,29),29)","v":15},10,22,6,5,25,11,13,3,8,17,9,27,2,20,12,21,26,16,18,4,24,23,7,19,14,28]
[null,null,2]
[null,4,3,null,{"$f":"MOD(E3*E1,29)","v":1},{"$f":"MOD(F3*F1,29)","v":1},1,1,1,1,1,1,1,1,1,1,1,1,1,1,1,1,1,1,1,1,1,1,1,1,1,1]
[null,8,4]
[null,16,5]
[16,null,6]
[8,null,7]
[4,null,8]
[null,null,9]
[null,null,10]
[null,null,11]
[null,null,12]
[null,null,13]
[null,null,14]
[null,null,15]
[null,null,16]
[null,null,17]
[null,null,18]
[null,null,19]
[null,null,20]
[null,null,21]
[null,null,22]
[null,null,23]
[null,null,24]
[null,null,25]
[null,null,26]
[null,null,27]
[null,null,28]

{"sheet":"Hárok2","index":1,"n_rows":213,"n_cols":56,"rows_kept":213,"cut":false,"hidden":false,"merged":[]}
[1,2,3,4,5,6,7,8,9,10,11,12,13,14,15,16,17,18,19,20,null,null,{"$f":"MOD(MMULT(C4:J11,M4:T11),29)","v":1},0,0,0,0,0,0,0,null,null,null,null,null,null,null,null,null,null,null,null,null,null,null,null,null,null,null,null,null,null,0,0,{"$f":"CHAR(65+BA1)","v":"A"},0]
[null,null,null,null,null,null,null,null,null,null,null,null,null,null,null,null,null,null,null,null,null,null,0,1,0,0,0,0,0,0,null,null,null,null,null,null,null,null,null,null,null,null,null,null,null,null,null,null,null,null,null,null,1,{"$f":"MOD(MOD(BA2^3,29)*MOD(MOD(BA2^4,29)^2,29)*MOD(MOD(MOD(BA2^4,29)^2,29)^2,29),29)","v":1},{"$f":"CHAR(65+BA2)","v":"B"},1]
[null,null,1,2,3,4,5,6,7,8,null,null,1,2,3,4,5,6,7,8,null,null,0,0,1,0,0,0,0,0,null,null,null,null,null,null,null,null,null,null,null,null,null,null,null,null,null,null,null,null,null,null,2,15,"C",2]
[null,1,22,2,27,0,6,11,0,17,null,null,13,16,15,9,3,21,0,2,null,null,0,0,0,1,0,0,0,0,null,null,null,null,null,null,null,null,null,null,null,null,null,null,null,null,null,null,null,null,null,null,3,10,"D",3]
[null,2,3,19,3,5,23,6,7,22,null,null,28,8,16,18,8,15,28,18,null,null,0,0,0,0,1,0,0,0,null,null,null,null,null,null,null,null,null,null,null,null,null,null,null,null,null,null,null,null,null,null,4,22,"E",4]
[null,3,7,16,6,14,14,7,25,24,null,null,18,4,26,13,18,14,21,10,null,null,0,0,0,0,0,1,0,0,null,null,null,null,null,null,null,null,null,null,null,null,null,null,null,null,null,null,null,null,null,null,5,6,"F",5]
[null,4,24,6,5,18,1,14,19,27,null,null,8,1,23,13,16,1,2,6,null,null,0,0,0,0,0,0,1,0,null,null,null,null,null,null,null,null,null,null,null,null,null,null,null,null,null,null,null,null,null,null,6,5,"G",6]
[null,5,22,5,6,27,0,24,27,4,null,null,5,16,5,21,1,24,12,1,null,null,0,0,0,0,0,0,0,1,null,null,null,null,null,null,null,null,null,null,null,null,null,null,null,null,null,null,null,null,null,null,7,25,"H",7]
[null,6,22,20,15,5,3,27,2,5,null,null,8,3,10,6,22,1,17,18,null,null,null,null,null,null,null,null,null,null,null,null,null,null,null,null,null,null,null,null,null,null,null,null,null,null,null,null,null,null,null,null,8,11,"I",8]
[null,7,13,22,19,9,3,7,18,26,null,null,5,20,20,9,12,9,18,3,null,null,null,null,null,null,null,null,null,null,null,null,null,null,null,null,null,null,null,null,null,null,null,null,null,null,null,null,null,null,null,null,9,13,"J",9]
[null,8,18,7,16,0,13,11,1,6,null,null,28,19,23,14,10,25,1,22,null,null,null,null,null,null,null,null,null,null,null,null,"HILLOVSKÁ ŠIFRA",null,null,null,null,null,null,null,null,null,null,null,null,null,null,null,null,null,null,null,10,3,"K",10]
[null,null,null,null,null,null,null,null,null,null,null,null,null,null,null,null,null,null,null,null,null,null,null,null,null,null,null,null,null,null,null,null,null,null,null,null,null,null,null,null,null,null,null,null,null,null,null,null,null,null,null,null,11,8,"L",11]
[null,null,null,null,null,null,null,null,null,null,null,null,null,null,null,null,null,null,null,null,null,null,null,null,null,null,null,null,null,null,null,null,null,null,null,null,null,null,null,null,null,null,null,null,null,null,null,null,null,null,null,null,12,17,"M",12]
[null,null,{"$f":"VLOOKUP(C4,$BA$1:$BC$29,3)","v":"W"},{"$f":"VLOOKUP(D4,$BA$1:$BC$29,3)","v":"C"},".","A","G","L","A","R",null,null,{"$f":"VLOOKUP(M4,$BA$1:$BC$29,3)","v":"N"},"Q","P","J","D","V","A","C",null,null,{"$f":"C4","v":22},{"$f":"D4","v":2},27,0,6,11,0,17,null,{"$f":"VLOOKUP(AG14,$BC$1:$BD$29,2,FALSE)","v":3},"D",null,{"$f":"MOD(MMULT(W14:AD21,AF14:AF21),29)","v":12},{"$f":"VLOOKUP(AI14,$BA$1:$BC$29,3)","v":"M"},null,{"$f":"M4","v":13},{"$f":"N4","v":16},15,9,3,21,0,2,null,{"$f":"AI14","v":12},{"$f":"AJ14","v":"M"},null,{"$f":"MOD(MMULT(AL14:AS21,AU14:AU21),29)","v":3},{"$f":"VLOOKUP(AX14,$BA$1:$BC$29,3)","v":"D"},null,13,9,"N",13]
[null,null,{"$f":"VLOOKUP(C5,$BA$1:$BC$29,3)","v":"D"},"T","D","F","X","G","H","W",null,null,{"$f":"VLOOKUP(M5,$BA$1:$BC$29,3)","v":","},"I","Q","S","I","P",",","S",null,null,{"$f":"C5","v":3},19,3,5,23,6,7,22,null,{"$f":"VLOOKUP(AG15,$BC$1:$BD$29,2,FALSE)","v":14},"O",null,0,{"$f":"VLOOKUP(AI15,$BA$1:$BC$29,3)","v":"A"},null,{"$f":"M5","v":28},8,16,18,8,15,28,18,null,{"$f":"AI15","v":0},"A",null,14,{"$f":"VLOOKUP(AX15,$BA$1:$BC$29,3)","v":"O"},null,14,27,"O",14]
[null,null,{"$f":"VLOOKUP(C6,$BA$1:$BC$29,3)","v":"H"},"Q","G","O","O","H","Z","Y",null,null,{"$f":"VLOOKUP(M6,$BA$1:$BC$29,3)","v":"S"},"E"," ","N","S","O","V","K",null,null,{"$f":"C6","v":7},16,6,14,14,7,25,24,null,26," ",null,14,"O",null,{"$f":"M6","v":18},4,26,13,18,14,21,10,null,14,"O",null,26," ",null,15,2,"P",15]
[null,null,{"$f":"VLOOKUP(C7,$BA$1:$BC$29,3)","v":"Y"},"G","F","S","B","O","T",".",null,null,{"$f":"VLOOKUP(M7,$BA$1:$BC$29,3)","v":"I"},"B","X","N","Q","B","C","G",null,null,{"$f":"C7","v":24},6,5,18,1,14,19,27,"X",10,"K","=",16,"Q",null,{"$f":"M7","v":8},1,23,13,16,1,2,6,"X",16,"Q","=",10,"K",null,16,20,"Q",16]
[null,null,{"$f":"VLOOKUP(C8,$BA$1:$BC$29,3)","v":"W"},"F","G",".","A","Y",".","E",null,null,{"$f":"VLOOKUP(M8,$BA$1:$BC$29,3)","v":"F"},"Q","F","V","B","Y","M","B",null,null,{"$f":"C8","v":22},5,6,27,0,24,27,4,null,24,"Y",null,5,"F",null,{"$f":"M8","v":5},16,5,21,1,24,12,1,null,5,"F",null,24,"Y",null,17,12,"R",17]
[null,null,{"$f":"VLOOKUP(C9,$BA$1:$BC$29,3)","v":"W"},"U","P","F","D",".","C","F",null,null,{"$f":"VLOOKUP(M9,$BA$1:$BC$29,3)","v":"I"},"D","K","G","W","B","R","S",null,null,{"$f":"C9","v":22},20,15,5,3,27,2,5,null,18,"S",null,2,"C",null,{"$f":"M9","v":8},3,10,6,22,1,17,18,null,2,"C",null,18,"S",null,18,21,"S",18]
[null,null,{"$f":"VLOOKUP(C10,$BA$1:$BC$29,3)","v":"N"},"W","T","J","D","H","S"," ",null,null,{"$f":"VLOOKUP(M10,$BA$1:$BC$29,3)","v":"F"},"U","U","J","M","J","S","D",null,null,{"$f":"C10","v":13},22,19,9,3,7,18,26,null,20,"U",null,4,"E",null,{"$f":"M10","v":5},20,20,9,12,9,18,3,null,4,"E",null,20,"U",null,19,26,"T",19]
[null,null,{"$f":"VLOOKUP(C11,$BA$1:$BC$29,3)","v":"S"},"H","Q","A","N","L","B","G",null,null,{"$f":"VLOOKUP(M11,$BA$1:$BC$29,3)","v":","},"T","X","O","K","Z","B","W",null,null,{"$f":"C11","v":18},7,16,0,13,11,1,6,null,2,"C",null,8,"I",null,{"$f":"M11","v":28},19,23,14,10,25,1,22,null,8,"I",null,2,"C",null,20,16,"U",20]
[null,null,null,null,null,null,null,null,null,null,null,null,null,null,null,null,null,null,null,null,null,null,null,null,null,null,null,null,null,null,null,null,null,null,null,null,null,null,null,null,null,null,null,null,null,null,null,null,null,null,null,null,21,18,"V",21]
[null,null,null,null,null,null,null,null,null,null,null,null,null,null,null,null,null,null,null,null,null,null,null,null,null,"K",null,null,null,null,null,null,null,null,null,null,null,null,null,"K^-1",null,null,null,null,null,null,null,null,null,null,null,null,22,4,"W",22]
[null,null,null,null,null,null,null,null,null,null,null,null,null,null,null,null,null,null,null,null,null,null,null,null,null,null,null,null,null,null,null,null,null,null,null,null,null,null,null,null,null,null,null,null,null,null,null,null,null,null,null,null,23,24,"X",23]
[null,null,null,null,null,null,null,null,null,null,null,null,null,null,null,null,null,null,null,null,null,null,null,null,null,null,null,null,null,null,null,null,null,null,null,null,null,null,null,null,null,null,null,null,null,null,null,null,null,null,null,null,24,23,"Y",24]
[{"$f":"VLOOKUP(C26,W37:X64,2)","v":4},null,22,2,27,0,6,11,0,17,1,0,0,0,0,0,0,0,null,null,null,null,null,null,null,null,null,null,null,null,null,null,null,null,null,null,null,null,null,null,null,null,null,null,null,null,null,null,null,null,null,null,25,7,"Z",25]
[null,null,3,19,3,5,23,6,7,22,0,1,0,0,0,0,0,0,null,null,null,null,null,null,null,null,null,null,null,null,null,null,null,null,null,null,null,null,null,null,null,null,null,null,null,null,null,null,null,null,null,null,26,19," ",26]
[null,null,7,16,6,14,14,7,25,24,0,0,1,0,0,0,0,0,null,null,null,null,null,null,null,null,null,null,null,null,null,null,null,null,null,null,null,null,null,null,null,null,null,null,null,null,null,null,null,null,null,null,27,14,".",27]
[null,null,24,6,5,18,1,14,19,27,0,0,0,1,0,0,0,0,null,null,null,null,null,null,null,null,null,null,null,null,null,null,null,null,null,null,null,null,null,null,null,null,null,null,null,null,null,null,null,null,null,null,28,28,",",28]
[null,null,22,5,6,27,0,24,27,4,0,0,0,0,1,0,0,0]
[null,null,22,20,15,5,3,27,2,5,0,0,0,0,0,1,0,0]
[null,null,13,22,19,9,3,7,18,26,0,0,0,0,0,0,1,0]
[null,null,18,7,16,0,13,11,1,6,0,0,0,0,0,0,0,1]
[]
[]
[null,null,1,8,21,0,24,15,0,10,4,0,0,0,0,0,0,0]
[null,null,0,24,27,5,9,19,7,21,17,1,0,0,0,0,0,0,null,null,null,null,1,{"$f":"MOD(MOD(W37^3,29)*MOD(MOD(W37^4,29)^2,29)*MOD(MOD(MOD(W37^4,29)^2,29)^2,29),29)","v":1}]
[null,null,0,18,4,14,20,18,25,12,1,0,1,0,0,0,0,0,null,null,null,null,2,15]
[null,null,0,17,23,18,5,2,19,19,20,0,0,1,0,0,0,0,null,null,null,null,3,10]
[null,null,0,3,8,27,23,13,27,16,28,0,0,0,1,0,0,0,null,null,null,null,4,22]
[null,null,0,18,17,5,26,16,2,17,28,0,0,0,0,1,0,0,null,null,null,null,5,6]
[null,null,0,5,7,9,10,15,18,12,6,0,0,0,0,0,1,0,null,null,null,null,6,5]
[null,null,0,8,15,0,16,2,1,0,15,0,0,0,0,0,0,1,null,null,null,null,7,25]
[null,null,null,null,null,null,null,null,null,null,null,null,null,null,null,null,null,null,null,null,null,null,8,11]
[null,null,null,null,null,null,null,null,null,null,null,null,null,null,null,null,null,null,null,null,null,null,9,13]
[null,null,1,8,21,0,24,15,0,10,4,0,0,0,0,0,0,0,null,null,null,null,10,3]
[null,null,0,1,12,28,4,2,16,19,14,23,0,0,0,0,0,0,null,null,null,null,11,8]
[null,null,0,0,20,3,6,11,27,18,10,21,1,0,0,0,0,0,null,null,null,null,12,17]
[null,null,0,0,22,6,24,26,8,15,14,15,0,1,0,0,0,0,null,null,null,null,13,9]
[null,null,0,0,1,1,11,7,8,17,15,18,0,0,1,0,0,0,null,null,null,null,14,27]
[null,null,0,0,4,23,12,9,4,23,8,21,0,0,0,1,0,0,null,null,null,null,15,2]
[null,null,0,0,5,14,19,5,25,4,23,1,0,0,0,0,1,0,null,null,null,null,16,20]
[null,null,0,0,6,8,13,15,18,22,19,19,0,0,0,0,0,1,null,null,null,null,17,12]
[null,null,null,null,null,null,null,null,null,null,null,null,null,null,null,null,null,null,null,null,null,null,18,21]
[null,null,null,null,null,null,null,null,null,null,null,null,null,null,null,null,null,null,null,null,null,null,19,26]
[null,null,1,8,21,0,24,15,0,10,4,0,0,0,0,0,0,0,null,null,null,null,20,16]
[null,null,0,1,12,28,4,2,16,19,14,23,0,0,0,0,0,0,null,null,null,null,21,18]
[null,null,0,0,1,19,9,2,26,27,15,17,16,0,0,0,0,0,null,null,null,null,22,4]
[null,null,0,0,0,23,0,11,16,1,3,18,25,1,0,0,0,0,null,null,null,null,23,24]
[null,null,0,0,0,11,2,5,11,19,0,1,13,0,1,0,0,0,null,null,null,null,24,23]
[null,null,0,0,0,5,5,1,16,2,6,11,23,0,0,1,0,0,null,null,null,null,25,7]
[null,null,0,0,0,6,3,24,11,14,6,3,7,0,0,0,1,0,null,null,null,null,26,19]
[null,null,0,0,0,10,17,3,7,5,16,4,20,0,0,0,0,1,null,null,null,null,27,14]
[null,null,null,null,null,null,null,null,null,null,null,null,null,null,null,null,null,null,null,null,null,null,28,28]
[]
[null,null,1,8,21,0,24,15,0,10,4,0,0,0,0,0,0,0]
[null,null,0,1,12,28,4,2,16,19,14,23,0,0,0,0,0,0]
[null,null,0,0,1,19,9,2,26,27,15,17,16,0,0,0,0,0]
[null,null,0,0,0,1,0,3,7,24,14,26,20,24,0,0,0,0]
[null,null,0,0,0,0,2,1,21,16,20,5,25,26,1,0,0,0]
[null,null,0,0,0,0,5,15,10,27,23,26,10,25,0,1,0,0]
[null,null,0,0,0,0,3,6,27,15,9,21,3,1,0,0,1,0]
[null,null,0,0,0,0,17,2,24,26,21,5,23,21,0,0,0,1]
[]
[]
[null,null,1,8,21,0,24,15,0,10,4,0,0,0,0,0,0,0]
[null,null,0,1,12,28,4,2,16,19,14,23,0,0,0,0,0,0]
[null,null,0,0,1,19,9,2,26,27,15,17,16,0,0,0,0,0]
[null,null,0,0,0,1,0,3,7,24,14,26,20,24,0,0,0,0]
[null,null,0,0,0,0,1,15,25,8,10,17,27,13,15,0,0,0]
[null,null,0,0,0,0,0,27,1,16,2,28,20,18,12,1,0,0]
[null,null,0,0,0,0,0,19,10,20,8,28,9,20,13,0,1,0]
[null,null,0,0,0,0,0,8,5,6,25,6,28,3,6,0,0,1]
[]
[]
[null,null,1,8,21,0,24,15,0,10,4,0,0,0,0,0,0,0]
[null,null,0,1,12,28,4,2,16,19,14,23,0,0,0,0,0,0]
[null,null,0,0,1,19,9,2,26,27,15,17,16,0,0,0,0,0]
[null,null,0,0,0,1,0,3,7,24,14,26,20,24,0,0,0,0]
[null,null,0,0,0,0,1,15,25,8,10,17,27,13,15,0,0,0]
[null,null,0,0,0,0,0,1,14,21,28,15,19,20,23,14,0,0]
[null,null,0,0,0,0,0,0,5,27,27,4,25,17,11,24,1,0]
[null,null,0,0,0,0,0,0,9,12,4,2,21,17,25,4,0,1]
[]
[]
[null,null,1,8,21,0,24,15,0,10,4,0,0,0,0,0,0,0]
[null,null,0,1,12,28,4,2,16,19,14,23,0,0,0,0,0,0]
[null,null,0,0,1,19,9,2,26,27,15,17,16,0,0,0,0,0]
[null,null,0,0,0,1,0,3,7,24,14,26,20,24,0,0,0,0]
[null,null,0,0,0,0,1,15,25,8,10,17,27,13,15,0,0,0]
[null,null,0,0,0,0,0,1,14,21,28,15,19,20,23,14,0,0]
[null,null,0,0,0,0,0,0,1,17,17,24,5,15,8,28,6,0]
[null,null,0,0,0,0,0,0,0,4,25,18,5,27,11,13,4,1]
[]
[]
[null,null,1,8,21,0,24,15,0,10,4,0,0,0,0,0,0,0]
[null,null,0,1,12,28,4,2,16,19,14,23,0,0,0,0,0,0]
[null,null,0,0,1,19,9,2,26,27,15,17,16,0,0,0,0,0]
[null,null,0,0,0,1,0,3,7,24,14,26,20,24,0,0,0,0]
[null,null,0,0,0,0,1,15,25,8,10,17,27,13,15,0,0,0]
[null,null,0,0,0,0,0,1,14,21,28,15,19,20,23,14,0,0]
[null,null,0,0,0,0,0,0,1,17,17,24,5,15,8,28,6,0]
[null,null,0,0,0,0,0,0,0,1,28,19,23,14,10,25,1,22]
[]
[]
[]
[]
[]
[]
[]
[]
[]
[]
[]
[]
[]
[]
[]
[]
[]
[]
[]
[]
[]
[]
[]
[]
[]
[]
[]
[]
[]
[]
[]
[]
[null,null,1,0,0,0,0,0,0,0,13,16,15,9,3,21,0,2]
[null,null,0,1,0,0,0,0,0,0,28,8,16,18,8,15,28,18]
[null,null,0,0,1,0,0,0,0,0,18,4,26,13,18,14,21,10]
[null,null,0,0,0,1,0,0,0,0,8,1,23,13,16,1,2,6]
[null,null,0,0,0,0,1,0,0,0,5,16,5,21,1,24,12,1]
[null,null,0,0,0,0,0,1,0,0,8,3,10,6,22,1,17,18]
[null,null,0,0,0,0,0,0,1,0,5,20,20,9,12,9,18,3]
[null,null,0,0,0,0,0,0,0,1,28,19,23,14,10,25,1,22]
[]
[]
[null,null,1,8,0,0,0,0,0,0,5,22,27,8,9,25,21,1]
[null,null,0,1,0,0,0,0,0,0,28,8,16,18,8,15,28,18]
[null,null,0,0,1,0,0,0,0,0,18,4,26,13,18,14,21,10]
[null,null,0,0,0,1,0,0,0,0,8,1,23,13,16,1,2,6]
[null,null,0,0,0,0,1,0,0,0,5,16,5,21,1,24,12,1]
[null,null,0,0,0,0,0,1,0,0,8,3,10,6,22,1,17,18]
[null,null,0,0,0,0,0,0,1,0,5,20,20,9,12,9,18,3]
[null,null,0,0,0,0,0,0,0,1,28,19,23,14,10,25,1,22]
[]
[]
[null,null,1,8,21,0,0,0,0,0,6,19,22,20,10,0,27,8]
[null,null,0,1,12,0,0,0,0,0,12,27,9,0,21,9,19,22]
[null,null,0,0,1,0,0,0,0,0,18,4,26,13,18,14,21,10]
[null,null,0,0,0,1,0,0,0,0,8,1,23,13,16,1,2,6]
[null,null,0,0,0,0,1,0,0,0,5,16,5,21,1,24,12,1]
[null,null,0,0,0,0,0,1,0,0,8,3,10,6,22,1,17,18]
[null,null,0,0,0,0,0,0,1,0,5,20,20,9,12,9,18,3]
[null,null,0,0,0,0,0,0,0,1,28,19,23,14,10,25,1,22]
[]
[]
[null,null,1,8,21,0,0,0,0,0,6,19,22,20,10,0,27,8]
[null,null,0,1,12,28,0,0,0,0,4,26,15,16,5,8,17,16]
[null,null,0,0,1,19,0,0,0,0,25,23,28,28,3,4,1,8]
[null,null,0,0,0,1,0,0,0,0,8,1,23,13,16,1,2,6]
[null,null,0,0,0,0,1,0,0,0,5,16,5,21,1,24,12,1]
[null,null,0,0,0,0,0,1,0,0,8,3,10,6,22,1,17,18]
[null,null,0,0,0,0,0,0,1,0,5,20,20,9,12,9,18,3]
[null,null,0,0,0,0,0,0,0,1,28,19,23,14,10,25,1,22]
[]
[]
[null,null,1,8,21,0,24,0,0,0,10,26,26,2,5,25,25,3]
[null,null,0,1,12,28,4,0,0,0,24,3,6,13,9,17,7,20]
[null,null,0,0,1,19,9,0,0,0,12,22,15,14,12,17,22,17]
[null,null,0,0,0,1,0,0,0,0,8,1,23,13,16,1,2,6]
[null,null,0,0,0,0,1,0,0,0,5,16,5,21,1,24,12,1]
[null,null,0,0,0,0,0,1,0,0,8,3,10,6,22,1,17,18]
[null,null,0,0,0,0,0,0,1,0,5,20,20,9,12,9,18,3]
[null,null,0,0,0,0,0,0,0,1,28,19,23,14,10,25,1,22]
[]
[]
[null,null,1,8,21,0,24,15,0,0,14,13,2,5,16,11,19,12]
[null,null,0,1,12,28,4,2,0,0,11,9,26,25,24,19,12,27]
[null,null,0,0,1,19,9,2,0,0,28,28,6,26,27,19,27,24]
[null,null,0,0,0,1,0,3,0,0,3,10,24,2,24,4,24,2]
[null,null,0,0,0,0,1,15,0,0,9,3,10,24,12,10,6,10]
[null,null,0,0,0,0,0,1,0,0,8,3,10,6,22,1,17,18]
[null,null,0,0,0,0,0,0,1,0,5,20,20,9,12,9,18,3]
[null,null,0,0,0,0,0,0,0,1,28,19,23,14,10,25,1,22]
[]
[]
[null,null,1,8,21,0,24,15,0,0,14,13,2,5,16,11,19,12]
[null,null,0,1,12,28,4,2,16,0,4,10,27,24,13,18,10,17]
[null,null,0,0,1,19,9,2,26,0,13,26,4,28,20,21,2,15]
[null,null,0,0,0,1,0,3,7,0,9,5,19,7,21,9,5,23]
[null,null,0,0,0,0,1,15,25,0,18,10,17,17,22,3,21,27]
[null,null,0,0,0,0,0,1,14,0,20,22,0,16,16,11,8,2]
[null,null,0,0,0,0,0,0,1,0,5,20,20,9,12,9,18,3]
[null,null,0,0,0,0,0,0,0,1,28,19,23,14,10,25,1,22]

{"sheet":"Hárok3","index":2,"n_rows":114,"n_cols":40,"rows_kept":114,"cut":false,"hidden":false,"merged":[]}
[0,0,{"$f":"CHAR(65+A1)","v":"A"},null,null,{"$f":"VLOOKUP(I1,$A$2:$B$29,2)","v":4},null,null,22,null,null,null,null,null,null,null,null,null,null,null,null,null,null,null,null,null,null,null,null,null,null,null,null,",",{"$f":"CODE(AH1)","v":44}]
[1,{"$f":"MOD(MOD(A2^3,29)*MOD(MOD(A2^4,29)^2,29)*MOD(MOD(MOD(A2^4,29)^2,29)^2,29),29)","v":1},{"$f":"CHAR(65+A2)","v":"B"}]
[2,15,"C"]
[3,10,"D",null,null,null,22,2,27,0,6,11,0,17,1,0,0,0,0,0,0,0,null,22,7,26,26,9,16,11,1,null,{"$f":"VLOOKUP(G4,$A$1:$C$29,3)","v":"W"},{"$f":"VLOOKUP(H4,$A$1:$C$29,3)","v":"C"},{"$f":"VLOOKUP(I4,$A$1:$C$29,3)","v":"."},{"$f":"VLOOKUP(J4,$A$1:$C$29,3)","v":"A"},{"$f":"VLOOKUP(K4,$A$1:$C$29,3)","v":"G"},{"$f":"VLOOKUP(L4,$A$1:$C$29,3)","v":"L"},{"$f":"VLOOKUP(M4,$A$1:$C$29,3)","v":"A"},{"$f":"VLOOKUP(N4,$A$1:$C$29,3)","v":"R"}]
[4,22,"E",null,null,null,3,19,28,28,28,6,7,22,0,1,0,0,0,0,0,0,null,9,2,24,18,6,17,9,23,null,{"$f":"VLOOKUP(G5,$A$1:$C$29,3)","v":"D"},"T",",",",",",","G","H","W"]
[5,6,"F",null,null,null,7,16,6,14,14,7,25,24,0,0,1,0,0,0,0,0,null,8,6,17,13,28,18,25,1,null,"H","Q","G","O","O","H","Z","Y"]
[6,5,"G",null,null,null,24,6,5,18,1,14,19,27,0,0,0,1,0,0,0,0,null,9,21,21,8,14,15,13,28,null,"Y","G","F","S","B","O","T","."]
[7,25,"H",null,null,null,22,5,6,27,0,24,27,4,0,0,0,0,1,0,0,0,null,22,9,26,6,5,3,6,27,null,"W","F","G",".","A","Y",".","E"]
[8,11,"I",null,null,null,28,20,15,5,3,27,2,5,0,0,0,0,0,1,0,0,null,14,2,26,13,8,3,8,9,null,",","U","P","F","D",".","C","F"]
[9,13,"J",null,null,null,13,22,19,9,3,7,18,26,0,0,0,0,0,0,1,0,null,25,24,28,2,1,22,14,3,null,"N","W","T","J","D","H","S"," "]
[10,3,"K",null,null,null,18,7,16,0,13,11,16,6,0,0,0,0,0,0,0,1,null,28,4,18,3,13,2,23,20,null,"S","H","Q","A","N","L","Q","G"]
[11,8,"L"]
[12,17,"M"]
[13,9,"N",null,null,null,{"$f":"MOD(4*G4,29)","v":1},{"$f":"MOD(4*H4,29)","v":8},21,0,24,15,0,10,4,0,0,0,0,0,0,0,null,{"$f":"MMULT(G4:N11,X4:AE11)","v":1480},464,1827,1189,1305,957,1450,696]
[14,27,"O",3,null,null,{"$f":"MOD(G5-$D15*G$14,29)","v":0},{"$f":"MOD(H5-$D15*H$14,29)","v":24},23,28,14,19,7,21,17,1,0,0,0,0,0,0,null,2204,1335,3074,1334,1798,1595,2088,2523]
[15,2,"P",7,null,null,{"$f":"MOD(G6-$D16*G$14,29)","v":0},18,4,14,20,18,25,12,1,0,1,0,0,0,0,0,null,2175,1247,2640,957,986,1363,1595,1769]
[16,20,"Q",24,null,null,{"$f":"MOD(G7-$D17*G$14,29)","v":0},17,23,18,5,2,19,19,20,0,0,1,0,0,0,0,null,2233,1189,2639,1248,1131,1363,1682,1421]
[17,12,"R",22,null,null,{"$f":"MOD(G8-$D18*G$14,29)","v":0},3,8,27,23,13,27,16,28,0,0,0,1,0,0,0,null,1943,1479,2813,1334,1045,1624,1450,1276]
[18,21,"S",28,null,null,{"$f":"MOD(G9-$D19*G$14,29)","v":0},28,7,5,27,13,2,15,4,0,0,0,0,1,0,0,null,1595,580,2494,1711,1160,1277,1305,1073]
[19,26,"T",13,null,null,{"$f":"MOD(G10-$D20*G$14,29)","v":0},5,7,9,10,15,18,12,6,0,0,0,0,0,1,0,null,2059,1015,2610,1276,1334,1537,1857,1508]
[20,16,"U",18,null,null,{"$f":"MOD(G11-$D21*G$14,29)","v":0},8,15,0,16,2,16,0,15,0,0,0,0,0,0,1,null,1595,783,2088,1073,899,1131,1189,813]
[21,18,"V"]
[22,4,"W"]
[23,24,"X",null,null,null,1,8,21,0,24,15,0,10,4,0,0,0,0,0,0,0,null,{"$f":"MOD(X14,29)","v":1},{"$f":"MOD(Y14,29)","v":0},0,0,0,0,0,0]
[24,23,"Y",null,null,null,0,{"$f":"MOD(23*H15,29)","v":1},{"$f":"MOD(23*I15,29)","v":7},6,3,2,16,19,14,23,0,0,0,0,0,0,null,{"$f":"MOD(X15,29)","v":0},1,0,0,0,0,0,0]
[25,7,"Z",18,null,null,0,{"$f":"MOD(H16-$D26*H$25,29)","v":0},{"$f":"MOD(I16-$D26*I$25,29)","v":23},22,24,11,27,18,10,21,1,0,0,0,0,0,null,{"$f":"MOD(X16,29)","v":0},0,1,0,0,0,0,0]
[26,19," ",17,null,null,0,{"$f":"MOD(H17-$D27*H$25,29)","v":0},20,3,12,26,8,15,14,15,0,1,0,0,0,0,null,{"$f":"MOD(X17,29)","v":0},0,0,1,0,0,0,0]
[27,14,".",3,null,null,0,{"$f":"MOD(H18-$D28*H$25,29)","v":0},16,9,14,7,8,17,15,18,0,0,1,0,0,0,null,{"$f":"MOD(X18,29)","v":0},0,0,0,1,0,0,0]
[28,28,",",28,null,null,0,{"$f":"MOD(H19-$D29*H$25,29)","v":0},14,11,1,15,18,5,18,23,0,0,0,1,0,0,null,{"$f":"MOD(X19,29)","v":0},0,0,0,0,1,0,0]
[null,null,null,5,null,null,0,{"$f":"MOD(H20-$D30*H$25,29)","v":0},1,8,24,5,25,4,23,1,0,0,0,0,1,0,null,{"$f":"MOD(X20,29)","v":0},0,0,0,0,0,1,0]
[null,null,null,8,null,null,0,{"$f":"MOD(H21-$D31*H$25,29)","v":0},17,10,21,15,4,22,19,19,0,0,0,0,0,1,null,{"$f":"MOD(X21,29)","v":0},0,0,0,0,0,0,1]
[]
[]
[]
[]
[]
[null,null,null,null,null,null,1,8,21,0,24,15,0,10,4,0,0,0,0,0,0,0]
[null,null,null,null,null,null,0,1,7,6,3,2,16,19,14,23,0,0,0,0,0,0]
[null,null,null,null,null,null,0,0,1,6,25,3,10,26,8,11,24,0,0,0,0,0]
[null,null,null,null,null,null,0,0,0,1,24,5,18,12,1,2,16,28,0,0,0,0]
[null,null,null,null,null,null,0,0,0,0,1,11,4,25,19,24,4,0,16,0,0,0]
[null,null,null,null,null,null,0,0,0,0,0,1,24,9,25,5,19,1,4,27,0,0]
[null,null,null,null,null,null,0,0,0,0,0,0,1,10,15,6,5,3,15,13,12,0]
[null,null,null,null,null,null,0,0,0,0,0,0,0,1,28,4,18,3,13,2,23,20]
[]
[]
[null,null,null,10,null,null,{"$f":"MOD(G37-$D47*G$44,29)","v":1},8,21,0,24,15,0,0,14,18,23,28,15,9,2,3]
[null,null,null,19,null,null,{"$f":"MOD(G38-$D48*G$44,29)","v":0},1,7,6,3,2,16,0,4,5,6,1,14,20,27,26]
[null,null,null,26,null,null,{"$f":"MOD(G39-$D49*G$44,29)","v":0},0,1,6,25,3,10,0,5,23,20,9,10,6,11,2]
[null,null,null,12,null,null,{"$f":"MOD(G40-$D50*G$44,29)","v":0},0,0,1,24,5,18,0,13,12,3,21,18,5,14,21]
[null,null,null,25,null,null,{"$f":"MOD(G41-$D51*G$44,29)","v":0},0,0,0,1,11,4,0,15,11,18,12,10,8,5,22]
[null,null,null,9,null,null,{"$f":"MOD(G42-$D52*G$44,29)","v":0},0,0,0,0,1,24,0,5,27,2,3,3,9,25,23]
[null,null,null,10,null,null,{"$f":"MOD(G43-$D53*G$44,29)","v":0},{"$f":"MOD(H43-$D53*H$44,29)","v":0},0,0,0,0,1,0,25,24,28,2,1,22,14,3]
[null,null,null,1,null,null,0,0,0,0,0,0,0,1,28,4,18,3,13,2,23,20]
[]
[]
[null,null,null,0,null,null,{"$f":"MOD(G47-$D57*G$53,29)","v":1},8,21,0,24,15,0,0,14,18,23,28,15,9,2,3]
[null,null,null,16,null,null,{"$f":"MOD(G48-$D58*G$53,29)","v":0},1,7,6,3,2,0,0,10,27,22,27,27,16,6,7]
[null,null,null,10,null,null,{"$f":"MOD(G49-$D59*G$53,29)","v":0},0,1,6,25,3,0,0,16,15,1,18,0,18,16,1]
[null,null,null,18,null,null,{"$f":"MOD(G50-$D60*G$53,29)","v":0},0,0,1,24,5,0,0,27,15,21,14,0,15,23,25]
[null,null,null,4,null,null,{"$f":"MOD(G51-$D61*G$53,29)","v":0},0,0,0,1,11,0,0,2,2,22,4,6,7,7,10]
[null,null,null,24,null,null,{"$f":"MOD(G52-$D62*G$53,29)","v":0},{"$f":"MOD(H52-$D62*H$53,29)","v":0},0,0,0,1,0,0,14,2,26,13,8,3,8,9]
[null,null,null,null,null,null,0,0,0,0,0,0,1,0,25,24,28,2,1,22,14,3]
[null,null,null,null,null,null,0,0,0,0,0,0,0,1,28,4,18,3,13,2,23,20]
[]
[]
[null,null,null,15,null,null,{"$f":"MOD(G57-$D67*G$62,29)","v":1},8,21,0,24,0,0,0,7,17,10,7,11,22,27,13]
[null,null,null,2,null,null,{"$f":"MOD(G58-$D68*G$62,29)","v":0},1,7,6,3,0,0,0,11,23,28,1,11,10,19,18]
[null,null,null,3,null,null,{"$f":"MOD(G59-$D69*G$62,29)","v":0},0,1,6,25,0,0,0,3,9,10,8,5,9,21,3]
[null,null,null,5,null,null,{"$f":"MOD(G60-$D70*G$62,29)","v":0},0,0,1,24,0,0,0,15,5,7,7,18,0,12,9]
[null,null,null,11,null,null,{"$f":"MOD(G61-$D71*G$62,29)","v":0},{"$f":"MOD(H61-$D71*H$62,29)","v":0},0,0,1,0,0,0,22,9,26,6,5,3,6,27]
[null,null,null,null,null,null,0,0,0,0,0,1,0,0,14,2,26,13,8,3,8,9]
[null,null,null,null,null,null,0,0,0,0,0,0,1,0,25,24,28,2,1,22,14,3]
[null,null,null,null,null,null,0,0,0,0,0,0,0,1,28,4,18,3,13,2,23,20]
[]
[]
[null,null,null,24,null,null,{"$f":"MOD(G67-$D77*G$71,29)","v":1},8,21,0,0,0,0,0,1,4,24,8,7,8,28,3]
[null,null,null,3,null,null,{"$f":"MOD(G68-$D78*G$71,29)","v":0},1,7,6,0,0,0,0,3,25,8,12,25,1,1,24]
[null,null,null,25,null,null,{"$f":"MOD(G69-$D79*G$71,29)","v":0},0,1,6,0,0,0,0,4,16,27,3,25,21,16,24]
[null,null,null,24,null,null,{"$f":"MOD(G70-$D80*G$71,29)","v":0},{"$f":"MOD(H70-$D80*H$71,29)","v":0},0,1,0,0,0,0,9,21,21,8,14,15,13,28]
[null,null,null,null,null,null,0,0,0,0,1,0,0,0,22,9,26,6,5,3,6,27]
[null,null,null,null,null,null,0,0,0,0,0,1,0,0,14,2,26,13,8,3,8,9]
[null,null,null,null,null,null,0,0,0,0,0,0,1,0,25,24,28,2,1,22,14,3]
[null,null,null,null,null,null,0,0,0,0,0,0,0,1,28,4,18,3,13,2,23,20]
[]
[]
[null,null,null,0,null,null,{"$f":"MOD(G77-$D87*G$80,29)","v":1},8,21,0,0,0,0,0,1,4,24,8,7,8,28,3]
[null,null,null,6,null,null,{"$f":"MOD(G78-$D88*G$80,29)","v":0},1,7,0,0,0,0,0,7,15,27,22,28,27,10,1]
[null,null,null,6,null,null,{"$f":"MOD(G79-$D89*G$80,29)","v":0},{"$f":"MOD(H79-$D89*H$80,29)","v":0},1,0,0,0,0,0,8,6,17,13,28,18,25,1]
[null,null,null,null,null,null,0,0,0,1,0,0,0,0,9,21,21,8,14,15,13,28]
[null,null,null,null,null,null,0,0,0,0,1,0,0,0,22,9,26,6,5,3,6,27]
[null,null,null,null,null,null,0,0,0,0,0,1,0,0,14,2,26,13,8,3,8,9]
[null,null,null,null,null,null,0,0,0,0,0,0,1,0,25,24,28,2,1,22,14,3]
[null,null,null,null,null,null,0,0,0,0,0,0,0,1,28,4,18,3,13,2,23,20]
[]
[]
[null,null,null,21,null,null,{"$f":"MOD(G87-$D97*G$89,29)","v":1},8,0,0,0,0,0,0,7,23,15,25,28,7,25,11]
[null,null,null,7,null,null,{"$f":"MOD(G88-$D98*G$89,29)","v":0},{"$f":"MOD(H88-$D98*H$89,29)","v":1},0,0,0,0,0,0,9,2,24,18,6,17,9,23]
[null,null,null,null,null,null,0,0,1,0,0,0,0,0,8,6,17,13,28,18,25,1]
[null,null,null,null,null,null,0,0,0,1,0,0,0,0,9,21,21,8,14,15,13,28]
[null,null,null,null,null,null,0,0,0,0,1,0,0,0,22,9,26,6,5,3,6,27]
[null,null,null,null,null,null,0,0,0,0,0,1,0,0,14,2,26,13,8,3,8,9]
[null,null,null,null,null,null,0,0,0,0,0,0,1,0,25,24,28,2,1,22,14,3]
[null,null,null,null,null,null,0,0,0,0,0,0,0,1,28,4,18,3,13,2,23,20]
[]
[]
[null,null,null,8,null,null,{"$f":"MOD(G97-$D107*G$98,29)","v":1},{"$f":"MOD(H97-$D107*H$98,29)","v":0},0,0,0,0,0,0,22,7,26,26,9,16,11,1]
[null,null,null,null,null,null,0,1,0,0,0,0,0,0,9,2,24,18,6,17,9,23]
[null,null,null,null,null,null,0,0,1,0,0,0,0,0,8,6,17,13,28,18,25,1]
[null,null,null,null,null,null,0,0,0,1,0,0,0,0,9,21,21,8,14,15,13,28]
[null,null,null,null,null,null,0,0,0,0,1,0,0,0,22,9,26,6,5,3,6,27]
[null,null,null,null,null,null,0,0,0,0,0,1,0,0,14,2,26,13,8,3,8,9]
[null,null,null,null,null,null,0,0,0,0,0,0,1,0,25,24,28,2,1,22,14,3]
[null,null,null,null,null,null,0,0,0,0,0,0,0,1,28,4,18,3,13,2,23,20]

{"sheet":"Hárok4","index":3,"n_rows":9,"n_cols":12,"rows_kept":9,"cut":false,"hidden":false,"merged":[]}
[null,null,"TRANSPOZIČNÁ  ŠIFRA"]
[]
[null,null,1,2,3,4,5,6]
[null,1,0,0,1,0,0,0,null,10,null,{"$f":"MMULT(C4:H9,J4:J9)","v":30}]
[null,2,1,0,0,0,0,0,null,20,null,10]
[null,3,0,1,0,0,0,0,"X",30,"=",20]
[null,4,0,0,0,0,0,1,null,40,null,60]
[null,5,0,0,0,1,0,0,null,50,null,40]
[null,6,0,0,0,0,1,0,null,60,null,50]

{"sheet":"Hárok5","index":4,"n_rows":16,"n_cols":67,"rows_kept":16,"cut":false,"hidden":false,"merged":[]}
["P","O","S","L","I","T","E"," ","D","O "," ","K","Y","S","U","C","K","E","H","O ",null,"N","O","V","E","H","O"," ","M","E","S","T","A","  ","D","A","L","S","I"," ","H","E","R","O","I","N",", "," ","K","O","K","A","I","N"," ","A"," ","M","A","R","I","H","U","A","N","U","."]
[]
[]
[]
[]
[]
[]
[]
["G"]
["N"]
["X"]
["P"]
["X"]
["P"]
["W"]
["."]